Problemer med Latex (tetex) på en opgraderet Leopard

Jeg købte med det samme Leopard kunne bestilles, en familielicens til alle mine macs. Min MacBookPro lavede jeg en ren installation, hvor jeg på min iMac lavede en opgradering, da systemet på den ikke er mere end et par måneder gammel.
Da jeg så ville installere tetex igennem MacPorts, fik jeg en mærkelig fejl, som jeg ikke fik da jeg installerede det på min MacBookPro som også kørte Leopard.

i686-apple-darwin9-gcc-4.0.1: 1/lib: No such file or directory
make[2]: *** [xdvi-xaw.bin] Error 1
make[1]: *** [all] Error 1
make: *** [all] Error 1

Efter at have søgt lidt på google, fandt jeg hurtigt svaret.
Så efter at have hørt følgende, havde jeg et fuldt virkende Latex installation med bland andet pdflatex. Lækkert.

sudo port install openmotif
sudo port clean tetex
sudo port install tetex

**Update**
Jeg glemte helt at fortælle om den lille guide jeg fulgte for at få latex til at spille sammen med [Textmate](http://www.macromates.com) også. [Læs omkring den her](http://plesslweb.ch/2007/04/02/setting-up-latex-on-mac-os-x/)

7 responses to “Problemer med Latex (tetex) på en opgraderet Leopard

  1. Although I don’t know Danish – installing openmotif helped me with this issue, thank you!

  2. Heh, You are welcome.
    Actually I am thinking about start writting in english.

  3. I’m also a non-speaker of Danish. Nevertheless, like the previous poster, your suggestion helped me! Thank you.

  4. Again, another non danish speaker sends his regards. You solved my problem too. Writing in English sounds like a good idea, I for one will be bookmarking your site for the future.

  5. Coooool.

    Someone on the Tetex TRAC site says something renamed a directory, splitting X11R61 into X11R6 1, then there was a /lib directory underneath.

    Danish’s are tasty, and smart!

    Unfortunately I was building something else, which didn’t work, but I’ll fix that soon enough:

    doxygen
    portable.cpp: In function ‘size_t portable_iconv(void, const char, size_t, char*, size_t*)’:
    portable.cpp:385: error: invalid conversion from ‘const char
    ‘ to ‘char
    portable.cpp:385: error: initializing argument 2 of ‘size_t iconv(void, char*, size_t*, char
    , size_t
    )’
    make[2]: *** [../objects/portable.o] Error 1

    Cheers!
    Nick

  6. Thanks from another non-danish user whom you helped. You post was the only thing google turned out when I searched. Thanks a bunch for blogging this!

  7. Yet another non-Danish reader who benefitted from your blog.

    Thanks,
    Drew

Skriv et svar

Din e-mailadresse vil ikke blive publiceret. Krævede felter er markeret med *